Reaction Details
TargetDelta-type opioid receptor
LigandBDBM50404325
Substrate/Competitorn/a
Meas. Tech.ChEBML_145618
Ki>10000±n/a nM
Citation Chen, ZGoehring, RRValenzano, KJKyle, DJ Design and synthesis of novel small molecule N/OFQ receptor antagonists. Bioorg Med Chem Lett14:1347-51 (2004) 
 
Delta-type opioid receptor
Name:Delta-type opioid receptor
Type:G Protein-Coupled Receptor (GPCR)
Mol. Mass.:40382.98
Organism:Homo sapiens (Human)
Description:Competition binding assays were carried out using membrane preparations from transfected HN9.10 cells that constitutively expressed the delta opioid receptor.
Residue:372
BDBM50404325
NameBDBM50404325
Synonyms:CHEMBL2113262
TypeSmall organic molecule
Emp. Form.C22H37N3O
Mol. Mass.359.5487
SMILESO=C1N[C@@H]2CCCC[C@H]2N1C1CCN(CC1)C1CCC2CCCCC2C1