Reaction Details
TargetNociceptin receptor
LigandBDBM50140743
Substrate/Competitorn/a
Meas. Tech.ChEBML_144661
Ki 111±n/a nM
Citation Chen, ZGoehring, RRValenzano, KJKyle, DJ Design and synthesis of novel small molecule N/OFQ receptor antagonists. Bioorg Med Chem Lett14:1347-51 (2004) 
 
Nociceptin receptor
Name:Nociceptin receptor
Type:G Protein-Coupled Receptor (GPCR)
Mol. Mass.:40702.87
Organism:Homo sapiens (Human)
Description:P41146
Residue:370
BDBM50140743
NameBDBM50140743
Synonyms:(3aR,7aR)-1-(1-Cyclooctyl-piperidin-4-yl)-3-ethyl-octahydro-benzoimidazol-2-one | CHEMBL26464
TypeSmall organic molecule
Emp. Form.C22H39N3O
Mol. Mass.361.5646
SMILESCCN1[C@@H]2CCCC[C@H]2N(C2CCN(CC2)C2CCCCCCC2)C1=O