Reaction Details
TargetNociceptin receptor
LigandBDBM50140746
Substrate/Competitorn/a
Meas. Tech.ChEBML_144661
Ki 634±n/a nM
Citation Chen, ZGoehring, RRValenzano, KJKyle, DJ Design and synthesis of novel small molecule N/OFQ receptor antagonists. Bioorg Med Chem Lett14:1347-51 (2004) 
 
Nociceptin receptor
Name:Nociceptin receptor
Type:G Protein-Coupled Receptor (GPCR)
Mol. Mass.:40702.87
Organism:Homo sapiens (Human)
Description:P41146
Residue:370
BDBM50140746
NameBDBM50140746
Synonyms:(3aR,7aR)-1-[1-(4-Propyl-cyclohexyl)-piperidin-4-yl]-octahydro-benzoimidazol-2-one | CHEMBL26681
TypeSmall organic molecule
Emp. Form.C21H37N3O
Mol. Mass.347.538
SMILESCCCC1CCC(CC1)N1CCC(CC1)N1[C@@H]2CCCC[C@H]2NC1=O