Reaction Details
TargetKappa-type opioid receptor
LigandBDBM50140748
Substrate/Competitorn/a
Meas. Tech.ChEBML_145396
Ki>10000±n/a nM
Citation Chen, ZGoehring, RRValenzano, KJKyle, DJ Design and synthesis of novel small molecule N/OFQ receptor antagonists. Bioorg Med Chem Lett14:1347-51 (2004) 
 
Kappa-type opioid receptor
Name:Kappa-type opioid receptor
Type:G Protein-Coupled Receptor (GPCR)
Mol. Mass.:42648.76
Organism:Homo sapiens (Human)
Description:P41145
Residue:380
BDBM50140748
NameBDBM50140748
Synonyms:(3aR,7aR)-1-(1-Cyclooctylmethyl-piperidin-4-yl)-3-ethyl-octahydro-benzoimidazol-2-one | CHEMBL29953
TypeSmall organic molecule
Emp. Form.C23H41N3O
Mol. Mass.375.5911
SMILESCCN1[C@@H]2CCCC[C@H]2N(C2CCN(CC3CCCCCCC3)CC2)C1=O