Reaction Details
TargetNociceptin receptor
LigandBDBM50140741
Substrate/Competitorn/a
Meas. Tech.ChEBML_144661
Ki 16±n/a nM
Citation Chen, ZGoehring, RRValenzano, KJKyle, DJ Design and synthesis of novel small molecule N/OFQ receptor antagonists. Bioorg Med Chem Lett14:1347-51 (2004) 
 
Nociceptin receptor
Name:Nociceptin receptor
Type:G Protein-Coupled Receptor (GPCR)
Mol. Mass.:40702.87
Organism:Homo sapiens (Human)
Description:P41146
Residue:370
BDBM50140741
NameBDBM50140741
Synonyms:(3aR,7aR)-1-(1-Cyclooctylmethyl-piperidin-4-yl)-octahydro-benzoimidazol-2-one | CHEMBL280778
TypeSmall organic molecule
Emp. Form.C21H37N3O
Mol. Mass.347.538
SMILESO=C1N[C@@H]2CCCC[C@H]2N1C1CCN(CC2CCCCCCC2)CC1