Reaction Details
TargetMu-type opioid receptor
LigandBDBM50140731
Substrate/Competitorn/a
Meas. Tech.ChEBML_148227
Ki 421±n/a nM
Citation Chen, ZGoehring, RRValenzano, KJKyle, DJ Design and synthesis of novel small molecule N/OFQ receptor antagonists. Bioorg Med Chem Lett14:1347-51 (2004) 
 
Mu-type opioid receptor
Name:Mu-type opioid receptor
Type:G Protein-Coupled Receptor (GPCR)
Mol. Mass.:44789.51
Organism:Homo sapiens (Human)
Description:P35372
Residue:400
BDBM50140731
NameBDBM50140731
Synonyms:(3aR,7aR)-1-Ethyl-3-[1-(4-isopropyl-cyclohexyl)-piperidin-4-yl]-octahydro-benzoimidazol-2-one | CHEMBL282195
TypeSmall organic molecule
Emp. Form.C23H41N3O
Mol. Mass.375.5911
SMILESCCN1[C@@H]2CCCC[C@H]2N(C2CCN(CC2)C2CCC(CC2)C(C)C)C1=O