Reaction Details
TargetEpidermal growth factor receptor
LigandBDBM50141145
Substrate/Competitorn/a
Meas. Tech.ChEBML_63781
IC50 1020±n/a nM
Citation Wissner, AHamann, PRNilakantan, RGreenberger, LMYe, FRapuano, TALoganzo, F Syntheses and EGFR kinase inhibitory activity of 6-substituted-4-anilino [1,7] and [1,8] naphthyridine-3-carbonitriles. Bioorg Med Chem Lett14:1411-6 (2004) 
 
Epidermal growth factor receptor
Name:Epidermal growth factor receptor
Type:Receptor Kinase Domain
Mol. Mass.:134279.59
Organism:Homo sapiens (Human)
Description:P00533
Residue:1210
BDBM50141145
NameBDBM50141145
Synonyms:But-2-ynoic acid [4-(3-chloro-4-fluoro-phenylamino)-3-cyano-quinolin-6-yl]-amide | CHEMBL31876
TypeSmall organic molecule
Emp. Form.C20H12ClFN4O
Mol. Mass.378.787
SMILESCC#CC(=O)Nc1ccc2ncc(C#N)c(Nc3ccc(F)c(Cl)c3)c2c1