Reaction Details
TargetEpidermal growth factor receptor
LigandBDBM50122562
Substrate/Competitorn/a
Meas. Tech.ChEBML_63781
IC50 86.9±n/a nM
Citation Wissner, AHamann, PRNilakantan, RGreenberger, LMYe, FRapuano, TALoganzo, F Syntheses and EGFR kinase inhibitory activity of 6-substituted-4-anilino [1,7] and [1,8] naphthyridine-3-carbonitriles. Bioorg Med Chem Lett14:1411-6 (2004) 
 
Epidermal growth factor receptor
Name:Epidermal growth factor receptor
Type:Receptor Kinase Domain
Mol. Mass.:134279.59
Organism:Homo sapiens (Human)
Description:P00533
Residue:1210
BDBM50122562
NameBDBM50122562
Synonyms:CHEMBL281300 | N-[4-(3-Bromo-phenylamino)-3-cyano-quinolin-6-yl]-acrylamide
TypeSmall organic molecule
Emp. Form.C19H13BrN4O
Mol. Mass.393.237
SMILESBrc1cccc(Nc2c(cnc3ccc(NC(=O)C=C)cc23)C#N)c1