Reaction Details
TargetEpidermal growth factor receptor
LigandBDBM50141146
Substrate/Competitorn/a
Meas. Tech.ChEMBL_63781 (CHEMBL677385)
IC50 3762±n/a nM
Citation Wissner, AHamann, PRNilakantan, RGreenberger, LMYe, FRapuano, TALoganzo, F Syntheses and EGFR kinase inhibitory activity of 6-substituted-4-anilino [1,7] and [1,8] naphthyridine-3-carbonitriles. Bioorg Med Chem Lett14:1411-6 (2004) 
 
Epidermal growth factor receptor
Name:Epidermal growth factor receptor
Type:Receptor Kinase Domain
Mol. Mass.:134279.59
Organism:Homo sapiens (Human)
Description:P00533
Residue:1210
BDBM50141146
NameBDBM50141146
Synonyms:But-2-ynoic acid [5-(3-chloro-4-fluoro-phenylamino)-6-cyano-[1,8]naphthyridin-3-yl]-amide | CHEMBL287022
TypeSmall organic molecule
Emp. Form.C19H11ClFN5O
Mol. Mass.379.775
SMILESCC#CC(=O)Nc1cnc2ncc(C#N)c(Nc3ccc(F)c(Cl)c3)c2c1