Reaction Details
TargetEpidermal growth factor receptor
LigandBDBM50141149
Substrate/Competitorn/a
Meas. Tech.ChEMBL_63781 (CHEMBL677385)
IC50 1.9±n/a nM
Citation Wissner, AHamann, PRNilakantan, RGreenberger, LMYe, FRapuano, TALoganzo, F Syntheses and EGFR kinase inhibitory activity of 6-substituted-4-anilino [1,7] and [1,8] naphthyridine-3-carbonitriles. Bioorg Med Chem Lett14:1411-6 (2004) 
 
Epidermal growth factor receptor
Name:Epidermal growth factor receptor
Type:Receptor Kinase Domain
Mol. Mass.:134279.59
Organism:Homo sapiens (Human)
Description:P00533
Residue:1210
BDBM50141149
NameBDBM50141149
Synonyms:(E)-4-Dimethylamino-but-2-enoic acid [4-(3-bromo-phenylamino)-3-cyano-[1,7]naphthyridin-6-yl]-amide | CHEMBL31276
TypeSmall organic molecule
Emp. Form.C21H19BrN6O
Mol. Mass.451.319
SMILESCN(C)C\C=C\C(=O)Nc1cc2c(Nc3cccc(Br)c3)c(cnc2cn1)C#N