Reaction Details
TargetEpidermal growth factor receptor
LigandBDBM50141151
Substrate/Competitorn/a
Meas. Tech.ChEMBL_63781 (CHEMBL677385)
IC50 6266±n/a nM
Citation Wissner, AHamann, PRNilakantan, RGreenberger, LMYe, FRapuano, TALoganzo, F Syntheses and EGFR kinase inhibitory activity of 6-substituted-4-anilino [1,7] and [1,8] naphthyridine-3-carbonitriles. Bioorg Med Chem Lett14:1411-6 (2004) 
 
Epidermal growth factor receptor
Name:Epidermal growth factor receptor
Type:Receptor Kinase Domain
Mol. Mass.:134279.59
Organism:Homo sapiens (Human)
Description:P00533
Residue:1210
BDBM50141151
NameBDBM50141151
Synonyms:But-2-ynoic acid [5-(3-bromo-phenylamino)-6-cyano-[1,8]naphthyridin-3-yl]-amide | CHEMBL31745
TypeSmall organic molecule
Emp. Form.C19H12BrN5O
Mol. Mass.406.235
SMILESCC#CC(=O)Nc1cnc2ncc(C#N)c(Nc3cccc(Br)c3)c2c1