Reaction Details
TargetIntegrase
LigandBDBM50141234
Substrate/Competitorn/a
Meas. Tech.ChEMBL_90870 (CHEMBL699303)
IC50 70±n/a nM
Citation Mustata, GIBrigo, ABriggs, JM HIV-1 integrase pharmacophore model derived from diverse classes of inhibitors. Bioorg Med Chem Lett14:1447-54 (2004) 
 
Integrase
Name:Integrase
Synonyms:Human immunodeficiency virus type 1 integrase
Type:PROTEIN
Mol. Mass.:32231.48
Organism:Human immunodeficiency virus 1
Description:ChEMBL_90865
Residue:288
BDBM50141234
NameBDBM50141234
TypeSmall organic molecule
Emp. Form.C62H76N10O8
Mol. Mass.1089.329
SMILESCC1C=C(NC(=O)C2=CC(NC(=O)C3=CC(=CC3C)N(C)C(=O)c3ccc(cc3)C(=O)N(C)C3=CC(C)C(=C3)C(=O)NC3=CC(C)C(=C3)C(=O)NC3=CC(C)C(=C3)C(=O)NCCCN(C)C)=CC2C)C=C1C(=O)NCCCN(C)C