Reaction Details
TargetEquilibrative nucleoside transporter 1
LigandBDBM23620
Substrate/Competitorn/a
Meas. Tech.ChEBML_216398
Ki 8.8±n/a nM
Citation Gupte, ABuolamwini, JK Novel halogenated nitrobenzylthioinosine analogs as es nucleoside transporter inhibitors. Bioorg Med Chem Lett14:2257-60 (2004) 
 
Equilibrative nucleoside transporter 1
Name:Equilibrative nucleoside transporter 1
Type:Multi-pass membrane protein
Mol. Mass.:50225.92
Organism:Homo sapiens (Human)
Description:n/a
Residue:456
BDBM23620
NameBDBM23620
Synonyms:2-({6-[bis(2-hydroxyethyl)amino]-4,8-bis(piperidin-1-yl)pyrimido[5,4-d][1,3]diazin-2-yl}(2-hydroxyethyl)amino)ethan-1-ol Dipyridamine Dipyudamine Persantine cid_3108
TypeSmall organic molecule
Emp. Form.C24H40N8O4
Mol. Mass.504.6256
SMILESOCCN(CCO)c1nc(N2CCCCC2)c2nc(nc(N3CCCCC3)c2n1)N(CCO)CCO