Reaction Details
TargetCarbonic anhydrase 1
LigandBDBM11641
Substrate/Competitorn/a
Meas. Tech.ChEBML_47521
Ki 4000±n/a nM
Citation Pastorekova, SCasini, AScozzafava, AVullo, DPastorek, JSupuran, CT Carbonic anhydrase inhibitors: the first selective, membrane-impermeant inhibitors targeting the tumor-associated isozyme IX. Bioorg Med Chem Lett14:869-73 (2004) 
 
Carbonic anhydrase 1
Name:Carbonic anhydrase 1
Type:Enzyme
Mol. Mass.:28873.37
Organism:Homo sapiens (Human)
Description:P00915
Residue:261
BDBM11641
NameBDBM11641
Synonyms:1-N-(4-sulfamoylphenyl-ethyl)-2,4,6-trimethylpyridiniumperchlorate CHEMBL352535 pyridinium deriv. 10
TypeSmall organic molecule
Emp. Form.C16H21N2O2S
Mol. Mass.305.415
SMILESCc1cc(C)[n+](CCc2ccc(cc2)S(N)(=O)=O)c(C)c1