Reaction Details
TargetHistone deacetylase 1/2/3/4/5/6/7/8/9/11/Polyamine deacetylase HDAC10
LigandBDBM50221740
Substrate/Competitorn/a
Meas. Tech.ChEMBL_87707 (CHEMBL877727)
IC50 1350±n/a nM
Citation Nishino, NYoshikawa, DWatanabe, LAKato, TJose, BKomatsu, YSumida, YYoshida, M Synthesis and histone deacetylase inhibitory activity of cyclic tetrapeptides containing a retrohydroxamate as zinc ligand. Bioorg Med Chem Lett14:2427-31 (2004) 
 
Histone deacetylase 1/2/3/4/5/6/7/8/9/11/Polyamine deacetylase HDAC10
Name:Histone deacetylase 1/2/3/4/5/6/7/8/9/11/Polyamine deacetylase HDAC10
Synonyms:Histone deacetylase
Type:n/a
Mol. Mass.:n/a
Description:ASSAY_ID of ChEMBL is 87707
Components:This complex has 11 components.
Component 1
Name:Histone deacetylase 2
Type:PROTEIN
Mol. Mass.:55294.47
Organism:Mus musculus
Description:ChEMBL_117015
Residue:488
Component 2
Name:Histone deacetylase 1
Synonyms:HD1 Hdac1 | Histone deacetylase 1/2
Type:Protein
Mol. Mass.:55062.26
Organism:Mus musculus (Mouse)
Description:O09106
Residue:482
Component 3
Name:Histone deacetylase 6
Synonyms:HD6 Hdac6 Histone deacetylase | Histone deacetylase mHDA2
Type:PROTEIN
Mol. Mass.:125762.28
Organism:Mus musculus
Description:ChEMBL_1460074
Residue:1149
Component 4
Name:Histone deacetylase 5
Synonyms:HD5 Hdac5 Histone deacetylase mHDA1
Type:PROTEIN
Mol. Mass.:120932.97
Organism:Mus musculus
Description:ChEMBL_87889
Residue:1113
Component 5
Name:Histone deacetylase 4
Synonyms:3.5.1.98 HDAC4_MOUSE Histone deacetylase 4
Type:PROTEIN
Mol. Mass.:118571.33
Organism:Mus musculus
Description:ChEMBL_116900
Residue:1076
Component 6
Name:Histone deacetylase 9
Synonyms:3.5.1.98 HD9 Hdac7b Hdrp Histone deacetylase 9 MEF2-interacting transcription repressor MITR | Mitr
Type:PROTEIN
Mol. Mass.:65701.37
Organism:Mus musculus
Description:ChEMBL_116900
Residue:588
Component 7
Name:Histone deacetylase 7
Synonyms:3.5.1.98 HD7a Hdac7 Histone deacetylase 7 | Histone deacetylase 7A
Type:PROTEIN
Mol. Mass.:101302.81
Organism:Mus musculus
Description:ChEMBL_116900
Residue:938
Component 8
Name:Histone deacetylase 3
Synonyms:3.5.1.98 HDAC3_MOUSE Histone deacetylase 3
Type:PROTEIN
Mol. Mass.:48348.05
Organism:Mus musculus
Description:ChEMBL_116900
Residue:424
Component 9
Name:Histone deacetylase 8
Synonyms:HDAC8_MOUSE Histone deacetylase
Type:PROTEIN
Mol. Mass.:41767.71
Organism:Mus musculus
Description:ChEMBL_88030
Residue:377
Component 10
Name:Histone deacetylase 11
Synonyms:3.5.1.98 HDA11_MOUSE Histone deacetylase 11
Type:PROTEIN
Mol. Mass.:39160.64
Organism:Mus musculus
Description:ChEMBL_116900
Residue:347
Component 11
Name:Polyamine deacetylase HDAC10
Synonyms:3.5.1.98 HDA10_MOUSE Histone deacetylase 10
Type:PROTEIN
Mol. Mass.:72091.98
Organism:Mus musculus
Description:ChEMBL_116900
Residue:666
BDBM50221740
NameBDBM50221740
Synonyms:CHEMBL1790598
TypeSmall organic molecule
Emp. Form.C31H47N5O7
Mol. Mass.601.7342
SMILES[H][C@@]12CCCCN1C(=O)[C@@]([H])(NC(=O)[C@@H](Cc1ccc(OC)cc1)NC(=O)[C@H](CCCCCCN(O)C=O)NC2=O)[C@H](C)CC