Reaction Details
TargetHistone deacetylase 8
LigandBDBM19130
Substrate/Competitorn/a
Meas. Tech.ChEBML_88030
IC50 40±n/a nM
Citation Nishino, NYoshikawa, DWatanabe, LAKato, TJose, BKomatsu, YSumida, YYoshida, M Synthesis and histone deacetylase inhibitory activity of cyclic tetrapeptides containing a retrohydroxamate as zinc ligand. Bioorg Med Chem Lett14:2427-31 (2004) 
 
Histone deacetylase 8
Name:Histone deacetylase 8
Type:PROTEIN
Mol. Mass.:41767.71
Organism:Mus musculus
Description:ChEMBL_88030
Residue:377
BDBM19130
NameBDBM19130
Synonyms:(2E,4E,6R)-7-[4-(dimethylamino)phenyl]-N-hydroxy-4,6-dimethyl-7-oxohepta-2,4-dienamide TSA | Trichostatin A (TSA)
TypeSmall organic molecule
Emp. Form.C17H22N2O3
Mol. Mass.302.3682
SMILESCC(C=CC(=O)NO)C=C(C)C(=O)c1ccc(cc1)N(C)C