Reaction Details
TargetHistone deacetylase 5
LigandBDBM50366966
Substrate/Competitorn/a
Meas. Tech.ChEBML_87889
IC50 89±n/a nM
Citation Nishino, NYoshikawa, DWatanabe, LAKato, TJose, BKomatsu, YSumida, YYoshida, M Synthesis and histone deacetylase inhibitory activity of cyclic tetrapeptides containing a retrohydroxamate as zinc ligand. Bioorg Med Chem Lett14:2427-31 (2004) 
 
Histone deacetylase 5
Name:Histone deacetylase 5
Type:PROTEIN
Mol. Mass.:120932.97
Organism:Mus musculus
Description:ChEMBL_87889
Residue:1113
BDBM50366966
NameBDBM50366966
Synonyms:CHEMBL1790596
TypeSmall organic molecule
Emp. Form.C29H43N5O7
Mol. Mass.573.681
SMILESCC[C@@H](C)[C@@H]1NC(=O)[C@@H](Cc2ccc(OC)cc2)NC(=O)[C@H](CCCCCN(O)C=O)NC(=O)[C@@H]2CCCN2C1=O