Reaction Details
TargetHistone deacetylase 1
LigandBDBM50366958
Substrate/Competitorn/a
Meas. Tech.ChEBML_87863
IC50 0.400000±n/a nM
Citation Nishino, NYoshikawa, DWatanabe, LAKato, TJose, BKomatsu, YSumida, YYoshida, M Synthesis and histone deacetylase inhibitory activity of cyclic tetrapeptides containing a retrohydroxamate as zinc ligand. Bioorg Med Chem Lett14:2427-31 (2004) 
 
Histone deacetylase 1
Name:Histone deacetylase 1
Type:Protein
Mol. Mass.:55062.26
Organism:Mus musculus (Mouse)
Description:O09106
Residue:482
BDBM50366958
NameBDBM50366958
Synonyms:CHEMBL1790587
TypeSmall organic molecule
Emp. Form.C29H43N5O7
Mol. Mass.573.681
SMILESCC[C@@H](C)[C@@H]1NC(=O)[C@@H](Cc2ccc(OC)cc2)NC(=O)[C@H](CCCCCC(=O)NO)NC(=O)[C@H]2CCCN2C1=O