Reaction Details
TargetHistone deacetylase 6
LigandBDBM50366966
Substrate/Competitorn/a
Meas. Tech.ChEBML_88025
IC50 29±n/a nM
Citation Nishino, NYoshikawa, DWatanabe, LAKato, TJose, BKomatsu, YSumida, YYoshida, M Synthesis and histone deacetylase inhibitory activity of cyclic tetrapeptides containing a retrohydroxamate as zinc ligand. Bioorg Med Chem Lett14:2427-31 (2004) 
 
Histone deacetylase 6
Name:Histone deacetylase 6
Type:PROTEIN
Mol. Mass.:125762.28
Organism:Mus musculus
Description:ChEMBL_1460074
Residue:1149
BDBM50366966
NameBDBM50366966
Synonyms:CHEMBL1790596
TypeSmall organic molecule
Emp. Form.C29H43N5O7
Mol. Mass.573.681
SMILESCC[C@@H](C)[C@@H]1NC(=O)[C@@H](Cc2ccc(OC)cc2)NC(=O)[C@H](CCCCCN(O)C=O)NC(=O)[C@@H]2CCCN2C1=O