Reaction Details
TargetAldehyde oxidase
LigandBDBM50366979
Substrate/Competitorn/a
Meas. Tech.ChEBML_31305
Ki 30000±n/a nM
Citation Cates, LAJones, GSGood, DJTsai, HYLi, VSCaron, NTu, SCKimball, AP Cyclophosphamide potentiation and aldehyde oxidase inhibition by phosphorylated aldehydes and acetals. J Med Chem23:300-4 (1980) Aldehyde oxidase
Name:Aldehyde oxidase
Type:PROTEIN
Mol. Mass.:147930.97
Organism:Homo sapiens (Human)
Description:ChEMBL_1481150
Residue:1338
BDBM50366979
NameBDBM50366979
Synonyms:PYRIDOXAL
TypeSmall organic molecule
Emp. Form.C8H9NO3
Mol. Mass.167.162
SMILESCc1ncc(CO)c(C=O)c1O