Reaction Details
TargetCholine O-acetyltransferase
LigandBDBM50029034
Substrate/Competitorn/a
Meas. Tech.ChEMBL_49269 (CHEMBL662976)
Ki 1600000±n/a nM
Citation Mautner, HGMerrill, RECurrier, SFHarvey, G Interaction of aromatic dyes with the coenzyme A binding site of choline acetyltransferase. J Med Chem24:1534-7 (1982) Choline O-acetyltransferase
Name:Choline O-acetyltransferase
Type:PROTEIN
Mol. Mass.:82561.12
Organism:Homo sapiens (Human)
Description:ChEMBL_49268
Residue:748
BDBM50029034
NameBDBM50029034
Synonyms:1-naphthalenesulfonate naphthalene-1-sulfonate | naphthalene-1-sulfonate(1-)
TypeSmall organic molecule
Emp. Form.C10H7O3S
Mol. Mass.207.226
SMILES[O-]S(=O)(=O)c1cccc2ccccc12