Reaction Details
TargetDihydrofolate reductase
LigandBDBM50025009
Substrate/Competitorn/a
Meas. Tech.ChEBML_54607
Ki 0.002400±n/a nM
Citation DeGraw, JIBrown, VHTagawa, HKisliuk, RLGaumont, YSirotnak, FM Synthesis and antitumor activity of 10-alkyl-10-deazaminopterins. A convenient synthesis of 10-deazaminopterin. J Med Chem25:1227-30 (1983) Dihydrofolate reductase
Name:Dihydrofolate reductase
Type:Enzyme
Mol. Mass.:21608.82
Organism:Mus musculus (Mouse)
Description:n/a
Residue:187
BDBM50025009
NameBDBM50025009
Synonyms:2-{4-[2-(2,4-Diamino-pteridin-6-yl)-1-methyl-ethyl]-benzoylamino}-pentanedioic acid 2-{4-[2-(2,4-Diamino-pteridin-6-yl)-ethyl]-benzoylamino}-pentanedioic acid | CHEMBL10515
TypeSmall organic molecule
Emp. Form.C21H23N7O5
Mol. Mass.453.4512
SMILESCC(Cc1cnc2nc(N)nc(N)c2n1)c1ccc(cc1)C(=O)NC(CCC(O)=O)C(O)=O