Reaction Details
TargetDihydrofolate reductase
LigandBDBM50010932
Substrate/Competitorn/a
Meas. Tech.ChEBML_54607
Ki 0.002100±n/a nM
Citation DeGraw, JIBrown, VHTagawa, HKisliuk, RLGaumont, YSirotnak, FM Synthesis and antitumor activity of 10-alkyl-10-deazaminopterins. A convenient synthesis of 10-deazaminopterin. J Med Chem25:1227-30 (1983) Dihydrofolate reductase
Name:Dihydrofolate reductase
Type:Enzyme
Mol. Mass.:21608.82
Organism:Mus musculus (Mouse)
Description:n/a
Residue:187
BDBM50010932
NameBDBM50010932
Synonyms:(10-DA, 10-Deazaminopterin)2-{4-[2-(2,4-Diamino-pteridin-6-yl)-ethyl]-benzoylamino}-pentanedioic acid 2-{4-[2-(2,4-Diamino-pteridin-6-yl)-ethyl]-benzoylamino}-pentanedioic acid(10-DAM) | CHEMBL11191
TypeSmall organic molecule
Emp. Form.C20H21N7O5
Mol. Mass.439.4246
SMILESNc1nc(N)c2nc(CCc3ccc(cc3)C(=O)NC(CCC(O)=O)C(O)=O)cnc2n1