Reaction Details
TargetAdenosine receptor A2a
LigandBDBM50389797
Substrate/Competitorn/a
Meas. Tech.ChEBML_75662
Ki 8±n/a nM
Citation Daly, JW Adenosine receptors: targets for future drugs. J Med Chem25:197-207 (1982) Adenosine receptor A2a
Name:Adenosine receptor A2a
Type:Enzyme Catalytic Domain
Mol. Mass.:44955.08
Organism:GUINEA PIG
Description:ADENOSINE A2 0 GUINEA PIG::P46616
Residue:409
BDBM50389797
NameBDBM50389797
Synonyms:CHEMBL261482
TypeSmall organic molecule
Emp. Form.C13H16N6O4
Mol. Mass.320.3039
SMILESNc1ncnc2n(cnc12)[C@@H]1O[C@@H]([C@@H](O)[C@H]1O)C(=O)NC1CC1