Reaction Details
TargetAdenosine receptor A1/A2a/A2b/A3
LigandBDBM50118810
Substrate/Competitorn/a
Meas. Tech.ChEMBL_192816 (CHEMBL798536)
Ki 0.600000±n/a nM
Citation Daly, JW Adenosine receptors: targets for future drugs. J Med Chem25:197-207 (1982) Adenosine receptor A1/A2a/A2b/A3
Name:Adenosine receptor A1/A2a/A2b/A3
Synonyms:Adenosine receptor
Type:n/a
Mol. Mass.:n/a
Description:ASSAY_ID of ChEMBL is 194205
Components:This complex has 4 components.
Component 1
Name:Adenosine receptor A2a
Type:G Protein-Coupled Receptor (GPCR)
Mol. Mass.:45015.65
Organism:Rattus norvegicus (rat)
Description:Rat A2A receptors expressed in CHO cells.
Residue:410
Component 2
Name:Adenosine receptor A3
Synonyms:AA3R_RAT Adenosine receptor A2a and A3 | Adora3
Type:PROTEIN
Mol. Mass.:36643.73
Organism:Rattus norvegicus
Description:ChEMBL_479910
Residue:320
Component 3
Name:Adenosine receptor A1
Synonyms:AA1R_RAT ADENOSINE A1 high Adenosine A1 receptor (A1) Adenosine receptors A1 | Adora1
Type:Protein
Mol. Mass.:36704.13
Organism:Rattus norvegicus (rat)
Description:n/a
Residue:326
Component 4
Name:Adenosine receptor A2b
Synonyms:AA2BR_RAT Adora2b
Type:PROTEIN
Mol. Mass.:36378.84
Organism:Rattus norvegicus
Description:ChEMBL_32934
Residue:332
BDBM50118810
NameBDBM50118810
Synonyms:(2R,3S,4R,5R)-2-(hydroxymethyl)-5-(6-((R)-1-phenylpropan-2-ylamino)-9H-purin-9-yl)-tetrahydrofuran-3,4-diol CHEMBL139000 R-N6-(phenylisopropyl)adenosine
TypeSmall organic molecule
Emp. Form.C19H23N5O4
Mol. Mass.385.417
SMILESC[C@H](Cc1ccccc1)Nc1ncnc2n(cnc12)[C@@H]1O[C@H](CO)[C@@H](O)[C@H]1O