Reaction Details
TargetAdenosine receptor A2a
LigandBDBM82015
Substrate/Competitorn/a
Meas. Tech.ChEBML_75662
Ki 400±n/a nM
Citation Daly, JW Adenosine receptors: targets for future drugs. J Med Chem25:197-207 (1982) Adenosine receptor A2a
Name:Adenosine receptor A2a
Type:Enzyme Catalytic Domain
Mol. Mass.:44955.08
Organism:GUINEA PIG
Description:ADENOSINE A2 0 GUINEA PIG::P46616
Residue:409
BDBM82015
NameBDBM82015
Synonyms:1,3-Dimethyl-8-phenyl-3,9-dihydro-purine-2,6-dione CAS_1922 NSC_1922
TypeSmall organic molecule
Emp. Form.C13H12N4O2
Mol. Mass.256.26
SMILESCn1c2nc([nH]c2c(=O)n(C)c1=O)-c1ccccc1