Reaction Details
TargetAlpha-2A adrenergic receptor
LigandBDBM50027034
Substrate/Competitorn/a
Meas. Tech.ChEBML_33034
Ki 1.8±n/a nM
Citation Saari, WSHalczenko, WRandall, WCLotti, VJ alpha-Adrenergic activities of some substituted 2-(aminomethyl)imidazolines. J Med Chem26:1769-72 (1984) Alpha-2A adrenergic receptor
Name:Alpha-2A adrenergic receptor
Type:Enzyme Catalytic Domain
Mol. Mass.:49275.13
Organism:BOVINE
Description:adrenergic Alpha2 0 BOVINE::Q28838
Residue:452
BDBM50027034
NameBDBM50027034
Synonyms:(4,5-Dihydro-1H-imidazol-2-ylmethyl)-phenyl-p-tolyl-amine | CHEMBL51131
TypeSmall organic molecule
Emp. Form.C17H19N3
Mol. Mass.265.3529
SMILESCc1ccc(cc1)N(CC1=NCCN1)c1ccccc1