Reaction Details
TargetSodium-dependent dopamine transporter
LigandBDBM50020240
Substrate/Competitorn/a
Meas. Tech.ChEBML_62002
IC50 110±n/a nM
Citation Bøgesø, KP Neuroleptic activity and dopamine-uptake inhibition in 1-piperazino-3-phenylindans. J Med Chem26:935-47 (1983) Sodium-dependent dopamine transporter
Name:Sodium-dependent dopamine transporter
Type:Multi-pass membrane protein
Mol. Mass.:68749.45
Organism:Rattus norvegicus (rat)
Description:P23977
Residue:619
BDBM50020240
NameBDBM50020240
Synonyms:1-[6-Fluoro-3-(4-fluoro-phenyl)-indan-1-yl]-4-methyl-piperazine CHEMBL307717
TypeSmall organic molecule
Emp. Form.C20H22F2N2
Mol. Mass.328.3989
SMILESCN1CCN(CC1)C1CC(c2ccc(F)cc12)c1ccc(F)cc1