Reaction Details
TargetSodium-dependent dopamine transporter
LigandBDBM50002012
Substrate/Competitorn/a
Meas. Tech.ChEMBL_62002 (CHEMBL670185)
IC50 520±n/a nM
Citation Bøgesø, KP Neuroleptic activity and dopamine-uptake inhibition in 1-piperazino-3-phenylindans. J Med Chem26:935-47 (1983) Sodium-dependent dopamine transporter
Name:Sodium-dependent dopamine transporter
Type:Multi-pass membrane protein
Mol. Mass.:68749.45
Organism:Rattus norvegicus (rat)
Description:P23977
Residue:619
BDBM50002012
NameBDBM50002012
Synonyms:(trans) 2-{4-[3-(4-Fluoro-phenyl)-6-trifluoromethyl-indan-1-yl]-piperazin-1-yl}-ethanol CHEMBL1204138 tefludazine
TypeSmall organic molecule
Emp. Form.C22H24F4N2O
Mol. Mass.408.4324
SMILESOCCN1CCN(CC1)C1CC(c2ccc(cc12)C(F)(F)F)c1ccc(F)cc1