Reaction Details
TargetBeta-1/Beta-2/Beta-3 adrenergic receptor
LigandBDBM50367137
Substrate/Competitorn/a
Meas. Tech.ChEMBL_144838 (CHEMBL752884)
IC50 30±n/a nM
Citation Bøgesø, KP Neuroleptic activity and dopamine-uptake inhibition in 1-piperazino-3-phenylindans. J Med Chem26:935-47 (1983) Beta-1/Beta-2/Beta-3 adrenergic receptor
Name:Beta-1/Beta-2/Beta-3 adrenergic receptor
Synonyms:Adrenergic receptor beta
Type:n/a
Mol. Mass.:n/a
Description:ASSAY_ID of ChEMBL is 1340543
Components:This complex has 3 components.
Component 1
Name:Beta-1 adrenergic receptor
Type:Protein
Mol. Mass.:50486.84
Organism:Rattus norvegicus (Rat)
Description:P18090
Residue:466
Component 2
Name:Beta-2 adrenergic receptor
Synonyms:ADRB2_RAT Adrb2r | Adrenergic receptor beta
Type:PROTEIN
Mol. Mass.:46896.26
Organism:Rattus norvegicus
Description:ChEMBL_38603
Residue:418
Component 3
Name:Beta-3 adrenergic receptor
Synonyms:ADRB3_RAT Adrb3r Beta-3 adrenergic receptor
Type:PROTEIN
Mol. Mass.:43161.83
Organism:Rattus norvegicus
Description:ChEMBL_1509452
Residue:400
BDBM50367137
NameBDBM50367137
Synonyms:CHEMBL1203891
TypeSmall organic molecule
Emp. Form.C23H28F2N2O
Mol. Mass.386.478
SMILESOCCCCN1CCN(CC1)C1CC(c2ccc(F)cc12)c1ccc(F)cc1