Reaction Details
TargetcAMP-regulated phosphoprotein 19
LigandBDBM50027797
Substrate/Competitorn/a
Meas. Tech.ChEBML_217391
EC50 2880±n/a nM
Citation Dandridge, PAKaiser, CBrenner, MGaitanopoulos, DDavis, LDWebb, RLFoley, JJSarau, HM Synthesis, resolution, absolute stereochemistry, and enantioselectivity of 3',4'-dihydroxynomifensine. J Med Chem27:28-35 (1984) cAMP-regulated phosphoprotein 19
Name:cAMP-regulated phosphoprotein 19
Type:PROTEIN
Mol. Mass.:12296.84
Organism:Rattus norvegicus
Description:ChEMBL_217391
Residue:112
BDBM50027797
NameBDBM50027797
Synonyms:4-(8-Amino-2-methyl-1,2,3,4-tetrahydro-isoquinolin-4-yl)-benzene-1,2-diol | CHEMBL119555
TypeSmall organic molecule
Emp. Form.C16H18N2O2
Mol. Mass.270.3263
SMILESCN1CC(c2ccc(O)c(O)c2)c2cccc(N)c2C1