Reaction Details
TargetD(2) dopamine receptor
LigandBDBM50027797
Substrate/Competitorn/a
Meas. Tech.ChEBML_61426
IC50 92000±n/a nM
Citation Dandridge, PAKaiser, CBrenner, MGaitanopoulos, DDavis, LDWebb, RLFoley, JJSarau, HM Synthesis, resolution, absolute stereochemistry, and enantioselectivity of 3',4'-dihydroxynomifensine. J Med Chem27:28-35 (1984) D(2) dopamine receptor
Name:D(2) dopamine receptor
Type:G Protein-Coupled Receptor (GPCR)
Mol. Mass.:50931.60
Organism:Rattus norvegicus (rat)
Description:P61169
Residue:444
BDBM50027797
NameBDBM50027797
Synonyms:4-(8-Amino-2-methyl-1,2,3,4-tetrahydro-isoquinolin-4-yl)-benzene-1,2-diol | CHEMBL119555
TypeSmall organic molecule
Emp. Form.C16H18N2O2
Mol. Mass.270.3263
SMILESCN1CC(c2ccc(O)c(O)c2)c2cccc(N)c2C1