Reaction Details
TargetAdenosine receptor A1
LigandBDBM50009552
Substrate/Competitorn/a
Meas. Tech.ChEBML_29335
Ki 1.3±n/a nM
Citation Moos, WHSzotek, DSBruns, RF N6-cycloalkyladenosines. Potent, A1-selective adenosine agonists. J Med Chem28:1383-4 (1985) Adenosine receptor A1
Name:Adenosine receptor A1
Type:Protein
Mol. Mass.:36704.13
Organism:Rattus norvegicus (rat)
Description:n/a
Residue:326
BDBM50009552
NameBDBM50009552
Synonyms:2-[6-Amino-2-(2-morpholin-4-yl-ethylamino)-purin-9-yl]-5-hydroxymethyl-tetrahydro-furan-3,4-diol CHEMBL45891 | N6-Cyclohexylado (CHA)
TypeSmall organic molecule
Emp. Form.C16H23N5O4
Mol. Mass.349.3849
SMILESOC[C@H]1O[C@H]([C@H](O)[C@@H]1O)n1cnc2c(NC3CCCCC3)ncnc12