Reaction Details
TargetAdenosine receptor A2a
LigandBDBM50018159
Substrate/Competitorn/a
Meas. Tech.ChEBML_27639
Ki 2500±n/a nM
Citation Daly, JWPadgett, WShamim, MTButts-Lamb, PWaters, J 1,3-Dialkyl-8-(p-sulfophenyl)xanthines: potent water-soluble antagonists for A1- and A2-adenosine receptors. J Med Chem28:487-92 (1985) Adenosine receptor A2a
Name:Adenosine receptor A2a
Type:Enzyme Catalytic Domain
Mol. Mass.:44955.08
Organism:GUINEA PIG
Description:ADENOSINE A2 0 GUINEA PIG::P46616
Residue:409
BDBM50018159
NameBDBM50018159
Synonyms:4-(1,3-Dimethyl-2,6-dioxo-2,3,6,7-tetrahydro-1H-purin-8-yl)-benzoic acid CHEMBL11048
TypeSmall organic molecule
Emp. Form.C14H12N4O4
Mol. Mass.300.2695
SMILESCn1c2nc([nH]c2c(=O)n(C)c1=O)-c1ccc(cc1)C(O)=O