Reaction Details
TargetAdenosine receptor A1
LigandBDBM82012
Substrate/Competitorn/a
Meas. Tech.ChEBML_28985
Ki 50±n/a nM
Citation Daly, JWPadgett, WShamim, MTButts-Lamb, PWaters, J 1,3-Dialkyl-8-(p-sulfophenyl)xanthines: potent water-soluble antagonists for A1- and A2-adenosine receptors. J Med Chem28:487-92 (1985) Adenosine receptor A1
Name:Adenosine receptor A1
Type:Protein
Mol. Mass.:36704.13
Organism:Rattus norvegicus (rat)
Description:n/a
Residue:326
BDBM82012
NameBDBM82012
Synonyms:8-(4-Hydroxy-phenyl)-1,3-dimethyl-3,7-dihydro-purine-2,6-dione CHEMBL27047
Typen/a
Emp. Form.C13H12N4O3
Mol. Mass.272.2594
SMILESCn1c2nc([nH]c2c(=O)n(C)c1=O)-c1ccc(O)cc1