Reaction Details
TargetDual specificity calcium/calmodulin-dependent 3',5'-cyclic nucleotide phosphodiesterase 1A/1B/1C
LigandBDBM14754
Substrate/Competitorn/a
Meas. Tech.ChEMBL_156150 (CHEMBL760919)
IC50 9000±n/a nM
Citation Weishaar, RECain, MHBristol, JA A new generation of phosphodiesterase inhibitors: multiple molecular forms of phosphodiesterase and the potential for drug selectivity. J Med Chem28:537-45 (1985) Dual specificity calcium/calmodulin-dependent 3',5'-cyclic nucleotide phosphodiesterase 1A/1B/1C
Name:Dual specificity calcium/calmodulin-dependent 3',5'-cyclic nucleotide phosphodiesterase 1A/1B/1C
Synonyms:Phosphodiesterase 1
Type:n/a
Mol. Mass.:n/a
Description:Combinations of UniProts
Components:This complex has 3 components.
Component 1
Name:Dual specificity calcium/calmodulin-dependent 3',5'-cyclic nucleotide phosphodiesterase 1C
Type:Enzyme
Mol. Mass.:80778.58
Organism:Homo sapiens (Human)
Description:Q14123
Residue:709
Component 2
Name:Dual specificity calcium/calmodulin-dependent 3',5'-cyclic nucleotide phosphodiesterase 1A
Synonyms:61 kDa Cam-PDE Cam-PDE 1A PDE1A_HUMAN | hCam-1
Type:Protein
Mol. Mass.:61245.69
Organism:Homo sapiens (Human)
Description:P54750
Residue:535
Component 3
Name:Dual specificity calcium/calmodulin-dependent 3',5'-cyclic nucleotide phosphodiesterase 1B
Synonyms:63 kDa Cam-PDE Calcium/calmodulin-dependent 3',5'-cyclic nucleotide phosphodiesterase 1B PDE1B PDE1B_HUMAN Phosphodiesterase 1B Phosphodiesterase Type 1 (PDE1B) | Phosphodiesterase, PDE1/PDE5
Type:Enzyme
Mol. Mass.:61366.51
Organism:Homo sapiens (Human)
Description:n/a
Residue:536
BDBM14754
NameBDBM14754
Synonyms:1-[(3,4-dimethoxyphenyl)methyl]-6,7-dimethoxy-isoquinoline 6,7-dimethoxy-1-veratryl-isoquinoline;hydrochloride Papaverine
TypeSmall organic molecule
Emp. Form.C20H21NO4
Mol. Mass.339.385
SMILESCOc1ccc(Cc2nccc3cc(OC)c(OC)cc23)cc1OC