Reaction Details
TargetcGMP-dependent 3',5'-cyclic phosphodiesterase
LigandBDBM50010981
Substrate/Competitorn/a
Meas. Tech.ChEMBL_155551 (CHEMBL759849)
IC50 390000±n/a nM
Citation Weishaar, RECain, MHBristol, JA A new generation of phosphodiesterase inhibitors: multiple molecular forms of phosphodiesterase and the potential for drug selectivity. J Med Chem28:537-45 (1985) cGMP-dependent 3',5'-cyclic phosphodiesterase
Name:cGMP-dependent 3',5'-cyclic phosphodiesterase
Type:Enzyme Catalytic Domain
Mol. Mass.:105691.58
Organism:Homo sapiens (Human)
Description:O00408
Residue:941
BDBM50010981
NameBDBM50010981
Synonyms:(Ro 20-1724)4-(3-Butoxy-4-methoxy-benzyl)-imidazolidin-2-one 4-(3-Butoxy-4-methoxy-benzyl)-imidazolidin-2-one(Ro 20-1724) CHEMBL18701 Ro-20-1724
TypeSmall organic molecule
Emp. Form.C15H22N2O3
Mol. Mass.278.3468
SMILESCCCCOc1cc(CC2CNC(=O)N2)ccc1OC