Reaction Details
TargetcGMP-dependent 3',5'-cyclic phosphodiesterase
LigandBDBM50000056
Substrate/Competitorn/a
Meas. Tech.ChEBML_155548
IC50 200000±n/a nM
Citation Weishaar, RECain, MHBristol, JA A new generation of phosphodiesterase inhibitors: multiple molecular forms of phosphodiesterase and the potential for drug selectivity. J Med Chem28:537-45 (1985) cGMP-dependent 3',5'-cyclic phosphodiesterase
Name:cGMP-dependent 3',5'-cyclic phosphodiesterase
Type:Enzyme Catalytic Domain
Mol. Mass.:105691.58
Organism:Homo sapiens (Human)
Description:O00408
Residue:941
BDBM50000056
NameBDBM50000056
Synonyms:(sulmazole)2-(4-Methanesulfinyl-2-methoxy-phenyl)-3H-imidazo[4,5-b]pyridine 2-(4-Methanesulfinyl-2-methoxy-phenyl)-1H-imidazo[4,5-b]pyridine (sulmazole) 2-(4-Methanesulfinyl-2-methoxy-phenyl)-3H-imidazo[4,5-b]pyridine CHEMBL286020
TypeSmall organic molecule
Emp. Form.C14H13N3O2S
Mol. Mass.287.337
SMILESCOc1cc(ccc1-c1nc2ncccc2[nH]1)S(C)=O