Reaction Details
TargetAdenosine receptor A1
LigandBDBM50367265
Substrate/Competitorn/a
Meas. Tech.ChEMBL_29631 (CHEMBL636648)
Ki 0.850000±n/a nM
Citation Jacobson, KAKirk, KLPadgett, WLDaly, JW Functionalized congeners of adenosine: preparation of analogues with high affinity for A1-adenosine receptors. J Med Chem28:1341-6 (1985) Adenosine receptor A1
Name:Adenosine receptor A1
Type:Protein
Mol. Mass.:36704.13
Organism:Rattus norvegicus (rat)
Description:n/a
Residue:326
BDBM50367265
NameBDBM50367265
Synonyms:BDBM50396917 CHEMBL603401
TypeSmall organic molecule
Emp. Form.C28H32N8O6
Mol. Mass.576.6037
SMILESNCCNC(=O)Cc1ccc(NC(=O)Cc2ccc(Nc3ncnc4n(cnc34)[C@@H]3O[C@H](CO)[C@@H](O)[C@H]3O)cc2)cc1