Reaction Details
TargetAdenosine receptor A1
LigandBDBM50367268
Substrate/Competitorn/a
Meas. Tech.ChEBML_29631
Ki 9.30±n/a nM
Citation Jacobson, KAKirk, KLPadgett, WLDaly, JW Functionalized congeners of adenosine: preparation of analogues with high affinity for A1-adenosine receptors. J Med Chem28:1341-6 (1985) Adenosine receptor A1
Name:Adenosine receptor A1
Type:Protein
Mol. Mass.:36704.13
Organism:Rattus norvegicus (rat)
Description:n/a
Residue:326
BDBM50367268
NameBDBM50367268
Synonyms:CHEMBL605875
TypeSmall organic molecule
Emp. Form.C30H34N8O7
Mol. Mass.618.6404
SMILESCC(=O)NCCNC(=O)Cc1ccc(NC(=O)Cc2ccc(Nc3ncnc4n(cnc34)C3O[C@H](CO)[C@@H](O)[C@H]3O)cc2)cc1