Reaction Details
TargetAdenosine receptor A1
LigandBDBM50367272
Substrate/Competitorn/a
Meas. Tech.ChEBML_29631
Ki 6.8±n/a nM
Citation Jacobson, KAKirk, KLPadgett, WLDaly, JW Functionalized congeners of adenosine: preparation of analogues with high affinity for A1-adenosine receptors. J Med Chem28:1341-6 (1985) Adenosine receptor A1
Name:Adenosine receptor A1
Type:Protein
Mol. Mass.:36704.13
Organism:Rattus norvegicus (rat)
Description:n/a
Residue:326
BDBM50367272
NameBDBM50367272
Synonyms:CHEMBL605460
TypeSmall organic molecule
Emp. Form.C25H26N6O5
Mol. Mass.490.5111
SMILESCc1ccccc1NC(=O)Cc1ccc(Nc2ncnc3n(cnc23)C2O[C@H](CO)[C@@H](O)[C@H]2O)cc1