Reaction Details
TargetAldo-keto reductase family 1 member B1
LigandBDBM50022178
Substrate/Competitorn/a
Meas. Tech.ChEMBL_31926 (CHEMBL642969)
IC50 62000±n/a nM
Citation Brubaker, ANDeRuiter, JWhitmer, WL Synthesis and rat lens aldose reductase inhibitory activity of some benzopyran-2-ones. J Med Chem29:1094-9 (1986) Aldo-keto reductase family 1 member B1
Name:Aldo-keto reductase family 1 member B1
Type:PROTEIN
Mol. Mass.:35797.87
Organism:Rattus norvegicus
Description:ChEMBL_1512484
Residue:316
BDBM50022178
NameBDBM50022178
Synonyms:4-Methyl-7-hydroxycoumarin 7-Hydroxy-4-methyl-2-oxo-2H-1-benzopyran 7-Hydroxy-4-methyl-2H-1-benzopyran-2-one 7-Hydroxy-4-methylcoumarin CHEMBL12208 Imecromone cid_5280567
TypeSmall organic molecule
Emp. Form.C10H8O3
Mol. Mass.176.1687
SMILESCc1cc(=O)oc2cc(O)ccc12