Reaction Details
TargetHistamine H1 receptor
LigandBDBM50019614
Substrate/Competitorn/a
Meas. Tech.ChEBML_75330
IC50 10±n/a nM
Citation Iemura, RKawashima, TFukuda, TIto, KTsukamoto, G Synthesis of 2-(4-substituted-1-piperazinyl)benzimidazoles as H1-antihistaminic agents. J Med Chem29:1178-83 (1987) Histamine H1 receptor
Name:Histamine H1 receptor
Type:G Protein-Coupled Receptor (GPCR)
Mol. Mass.:55641.53
Organism:Cavia porcellus (domestic guinea pig)
Description:Guinea pig cerebellum was used in binding assay.
Residue:488
BDBM50019614
NameBDBM50019614
Synonyms:1-(2-Butoxy-ethyl)-2-(4-methyl-[1,4]diazepan-1-yl)-1H-benzoimidazole | CHEMBL18561
TypeSmall organic molecule
Emp. Form.C19H30N4O
Mol. Mass.330.4677
SMILESCCCCOCCn1c(nc2ccccc12)N1CCCN(C)CC1