Reaction Details
TargetHistamine H1 receptor
LigandBDBM50019619
Substrate/Competitorn/a
Meas. Tech.ChEBML_75330
IC50 18±n/a nM
Citation Iemura, RKawashima, TFukuda, TIto, KTsukamoto, G Synthesis of 2-(4-substituted-1-piperazinyl)benzimidazoles as H1-antihistaminic agents. J Med Chem29:1178-83 (1987) Histamine H1 receptor
Name:Histamine H1 receptor
Type:G Protein-Coupled Receptor (GPCR)
Mol. Mass.:55641.53
Organism:Cavia porcellus (domestic guinea pig)
Description:Guinea pig cerebellum was used in binding assay.
Residue:488
BDBM50019619
NameBDBM50019619
Synonyms:2-(4-Methyl-piperazin-1-yl)-1-propoxymethyl-1H-benzoimidazole | CHEMBL17349
TypeSmall organic molecule
Emp. Form.C16H24N4O
Mol. Mass.288.388
SMILESCCCOCn1c(nc2ccccc12)N1CCN(C)CC1