Reaction Details
TargetMu-type opioid receptor
LigandBDBM50367339
Substrate/Competitorn/a
Meas. Tech.ChEBML_145291
Ki 0.760000±n/a nM
Citation Lipkowski, AWTam, SWPortoghese, PS Peptides as receptor selectivity modulators of opiate pharmacophores. J Med Chem29:1222-5 (1987) Mu-type opioid receptor
Name:Mu-type opioid receptor
Type:Enzyme Catalytic Domain
Mol. Mass.:11165.58
Organism:GUINEA PIG
Description:P97266
Residue:98
BDBM50367339
NameBDBM50367339
Synonyms:CHEMBL1202433
TypeSmall organic molecule
Emp. Form.C36H45N5O7
Mol. Mass.659.7718
SMILESCC(C)CC(NC(=O)C(Cc1ccccc1)NC(=O)NN=C1CC[C@@]2(O)C3Cc4ccc(O)c5O[C@@H]1C2(CCN3CC1CC1)c45)C(O)=O