Reaction Details
TargetThymidylate synthase
LigandBDBM50367343
Substrate/Competitorn/a
Meas. Tech.ChEMBL_211159 (CHEMBL817525)
IC50>1000000±n/a nM
Citation Ghazala, MNair, MGToghiyani, TRKisliuk, RLGaumont, YKalman, TI Folate analogues. 25. Synthesis and biological evaluation of N10-propargylfolic acid and its reduced derivatives. J Med Chem29:1263-9 (1987) Thymidylate synthase
Name:Thymidylate synthase
Type:PROTEIN
Mol. Mass.:34957.15
Organism:Mus musculus
Description:ChEMBL_1340097
Residue:307
BDBM50367343
NameBDBM50367343
Synonyms:(2S)-2-[[4-[(2-amino-4-oxo-1H-pteridin-6-yl)methylamino]benzoyl]amino]pentanedioic acid Folacin Vitamin B9 | Vitamin M
TypeSmall organic molecule
Emp. Form.C19H19N7O6
Mol. Mass.441.3975
SMILESNc1nc2ncc(CNc3ccc(cc3)C(=O)N[C@@H](CCC(O)=O)C(O)=O)nc2c(=O)[nH]1