Reaction Details
TargetThymidylate synthase
LigandBDBM50008291
Substrate/Competitorn/a
Meas. Tech.ChEBML_209111
IC50 390000±n/a nM
Citation Ghazala, MNair, MGToghiyani, TRKisliuk, RLGaumont, YKalman, TI Folate analogues. 25. Synthesis and biological evaluation of N10-propargylfolic acid and its reduced derivatives. J Med Chem29:1263-9 (1987) Thymidylate synthase
Name:Thymidylate synthase
Type:Enzyme
Mol. Mass.:36576.54
Organism:Lactobacillus casei
Description:n/a
Residue:316
BDBM50008291
NameBDBM50008291
Synonyms:2-{4-[(2-Amino-4-oxo-1,4-dihydro-pteridin-6-ylmethyl)-prop-2-ynyl-amino]-benzoylamino}-pentanedioic acid CHEMBL280145
TypeSmall organic molecule
Emp. Form.C22H21N7O6
Mol. Mass.479.4454
SMILESNc1nc2ncc(CN(CC#C)c3ccc(cc3)C(=O)NC(CCC(O)=O)C(O)=O)nc2c(=O)[nH]1