Reaction Details
TargetDihydrofolate reductase
LigandBDBM50022232
Substrate/Competitorn/a
Meas. Tech.ChEBML_53306
IC50 640±n/a nM
Citation Nair, MGNanavati, NTNair, IGKisliuk, RLGaumont, YHsiao, MCKalman, TI Folate analogues. 26. Syntheses and antifolate activity of 10-substituted derivatives of 5,8-dideazafolic acid and of the poly-gamma-glutamyl metabolites of N10-propargyl-5,8-dideazafolic acid (PDDF). J Med Chem29:1754-60 (1986) Dihydrofolate reductase
Name:Dihydrofolate reductase
Type:Enzyme
Mol. Mass.:21453.99
Organism:Homo sapiens (Human)
Description:Recombinant human DHFR.
Residue:187
BDBM50022232
NameBDBM50022232
Synonyms:2-{4-[(2-Amino-4-hydroxy-quinazolin-6-ylmethyl)-ethynyl-amino]-benzoylamino}-5-oxo-pentanoic acid anion
TypeSmall organic molecule
Emp. Form.C23H20N5O5
Mol. Mass.446.4359
SMILESNc1nc2ccc(CN(C#C)c3ccc(cc3)C(=O)NC(CCC=O)C([O-])=O)cc2c(=O)[nH]1