Reaction Details
Target5-hydroxytryptamine receptor 1B
LigandBDBM50019443
Substrate/Competitorn/a
Meas. Tech.ChEBML_1800
Ki 80±n/a nM
Citation Glennon, RA Central serotonin receptors as targets for drug research. J Med Chem30:1-12 (1987) 5-hydroxytryptamine receptor 1B
Name:5-hydroxytryptamine receptor 1B
Type:Protein
Mol. Mass.:43173.33
Organism:Rattus norvegicus (Rat)
Description:P28564
Residue:386
BDBM50019443
NameBDBM50019443
Synonyms:1-(1H-Indol-4-yloxy)-3-isopropylamino-propan-2-ol 1-(1H-Indol-4-yloxy)-3-isopropylamino-propan-2-ol(pindolol) LB-46 PINDOLOL,(-) VISKAZIDE | VISKEN
TypeSmall organic molecule
Emp. Form.C14H20N2O2
Mol. Mass.248.3208
SMILESCC(C)NCC(O)COc1cccc2[nH]ccc12