Reaction Details
TargetAdenosine receptor A1
LigandBDBM50452335
Substrate/Competitorn/a
Meas. Tech.ChEBML_29144
Ki 23±n/a nM
Citation Bridges, AJMoos, WHSzotek, DLTrivedi, BKBristol, JAHeffner, TGBruns, RFDowns, DA N6-(2,2-diphenylethyl)adenosine, a novel adenosine receptor agonist with antipsychotic-like activity. J Med Chem30:1709-11 (1987) Adenosine receptor A1
Name:Adenosine receptor A1
Type:Protein
Mol. Mass.:36704.13
Organism:Rattus norvegicus (rat)
Description:n/a
Residue:326
BDBM50452335
NameBDBM50452335
Synonyms:CHEMBL2113484
TypeSmall organic molecule
Emp. Form.C19H23N5O4
Mol. Mass.385.417
SMILESOC[C@H]1O[C@H]([C@H](O)[C@@H]1O)n1cnc2c(NCCCc3ccccc3)ncnc12